Target
Fructose-1,6-bisphosphatase 1
Ligand
BDBM23411
Substrate
Meas. Tech.
ChEMBL_1995781 (CHEMBL4629676)
IC50
38200±n/a nM
Citation
 Proença, COliveira, AFreitas, MRibeiro, DSousa, JLCRamos, MJSilva, AMSFernandes, PAFernandes, E Structural Specificity of Flavonoids in the Inhibition of Human Fructose 1,6-Bisphosphatase. J Nat Prod 83:1541-1552 (2020)  
Target
Name:
Fructose-1,6-bisphosphatase 1
Synonyms:
D-fructose-1,6-bisphosphate 1-phosphohydrolase 1 FBP FBPase 1 Fructose-1,6-bisphosphatase 1 | Fructose-1,6-bisphosphatase 1 (FBPase)
Type:
Protein
Mol. Mass.:
36843.58
Organism:
Homo sapiens (Human)
Description:
Liver FBPase (P09467)
Residue:
338
  
Inhibitor
Name:
BDBM23411
Synonyms:
5,6,7-trihydroxy-2-(4-hydroxyphenyl)-4H-chromen-4-one Scutellarein Scutellarein (28) | US10252984, Table 2.2
Type:
flavone
Emp. Form.:
C15H10O6
Mol. Mass.:
286.2363
SMILES:
Oc1ccc(cc1)-c1cc(=O)c2c(O)c(O)c(O)cc2o1
: