Target
Oxytocin receptor
Ligand
BDBM50103477
Substrate
Meas. Tech.
ChEMBL_145034 (CHEMBL753728)
Ki
0.6±n/a nM
Citation
 Carnazzi, EAumelas, AMouillac, BBreton, CGuillou, LBarberis, CSeyer, R Design, synthesis and pharmacological characterization of a potent radioiodinated and photoactivatable peptidic oxytocin antagonist. J Med Chem 44:3022-30 (2001)  
Target
Name:
Oxytocin receptor
Synonyms:
OT-R OXYR_HUMAN | Oxytocin
Type:
Enzyme Catalytic Domain
Mol. Mass.:
42793.26
Organism:
Homo sapiens (Human)
Description:
Oxytocin OXTR HEK293::B2R9L7
Residue:
389
  
Inhibitor
Name:
BDBM50103477
Synonyms:
CHEMBL386180 | Pmp-Tyr-Ile-Thr-Asn-Cys-Pro-Orn-phe(3I,4N3)-NH2
Type:
Small organic molecule
Emp. Form.:
C56H82IN15O13S2
Mol. Mass.:
1364.377
SMILES:
CC[C@H](C)[C@H](NC(=O)[C@H](Cc1ccc(O)cc1)NC(=O)CC1(CCCCC1)SCCC(N)=O)C(=O)N[C@@H]([C@@H](C)O)C(=O)N[C@@H](CC(N)=O)C(=O)N[C@@H](CS)C(=O)N1CCCC1C(=O)NC(CCCN)C(=O)NC(Cc1ccc(N=[N+]=[N-])c(I)c1)C(N)=O
: