Target
Calcium/calmodulin-dependent protein kinase type 1B
Ligand
BDBM50545573
Substrate
Meas. Tech.
ChEMBL_1996000 (CHEMBL4629895)
IC50
3.0±n/a nM
Citation
 Fromont, CAtzori, AKaur, DHashmi, LGreco, GCabanillas, ANguyen, HVJones, DHGarzón, MVarela, AStevenson, BIacobini, GPLenoir, MRajesh, SBox, CKumar, JGrant, PNovitskaya, VMorgan, JSorrell, FJRedondo, CKramer, AHarris, CJLeighton, BVickers, SPCheetham, SCKenyon, CGrabowska, AMOverduin, MBerditchevski, FWeston, CJKnapp, SFischer, PMButterworth, S Discovery of Highly Selective Inhibitors of Calmodulin-Dependent Kinases That Restore Insulin Sensitivity in the Diet-Induced Obesity  J Med Chem 63:6784-6801 (2020)  
Target
Name:
Calcium/calmodulin-dependent protein kinase type 1B
Synonyms:
CaM kinase I beta CaM-KI beta Calcium/calmodulin-dependent protein kinase type 1B PNCK | Pregnancy up-regulated non-ubiquitously-expressed CaM kinase
Type:
PROTEIN
Mol. Mass.:
38501.47
Organism:
Homo sapiens (Human)
Description:
ChEMBL_109914
Residue:
343
  
Inhibitor
Name:
BDBM50545573
Synonyms:
CHEMBL4635883 | US11530193, Example 54
Type:
Small organic molecule
Emp. Form.:
C21H31N7O
Mol. Mass.:
397.5171
SMILES:
CC(C)c1cc(Nc2nc(ncc2C(N)=O)N2CCC[C@H](N)C2)cc(n1)C(C)C
: