Target
Muscarinic acetylcholine receptor M2
Ligand
BDBM50095105
Substrate
Meas. Tech.
ChEBML_139750
Ki
0.010000±n/a nM
Citation
 Boyle, CDChackalamannil, SClader, JWGreenlee, WJJosien, HBKaminski, JJKozlowski, JAMcCombie, SWNazareno, DVTagat, JRWang, YZhou, GBillard, WBinch, HCrosby, GCohen-Williams, MCoffin, VLCox, KAGrotz, DEDuffy, RARuperto, VLachowicz, JE Metabolic stabilization of benzylidene ketal M(2) muscarinic receptor antagonists via halonaphthoic acid substitution. Bioorg Med Chem Lett 11:2311-4 (2001)  
Target
Name:
Muscarinic acetylcholine receptor M2
Synonyms:
ACM2_HUMAN Cholinergic, muscarinic M2 Muscarinic acetylcholine receptor M2 and M5 | RecName: Full=Muscarinic acetylcholine receptor M2
Type:
GPCR
Mol. Mass.:
51730.61
Organism:
Homo sapiens (Human)
Description:
P08172
Residue:
466
  
Inhibitor
Name:
BDBM50095105
Synonyms:
4-{2-[4-(Benzo[1,3]dioxole-5-sulfonyl)-phenyl]-[1,3]dioxolan-2-yl}-1'-(propane-1-sulfonyl)-[1,4']bipiperidinyl | CHEMBL76164
Type:
Small organic molecule
Emp. Form.:
C29H38N2O8S2
Mol. Mass.:
606.751
SMILES:
CCCS(=O)(=O)N1CCC(CC1)N1CCC(CC1)C1(OCCO1)c1ccc(cc1)S(=O)(=O)c1ccc2OCOc2c1
: