Target
Histone acetyltransferase KAT2B
Ligand
BDBM50504160
Substrate
Meas. Tech.
ChEMBL_1998348 (CHEMBL4650205)
Kd
4762±n/a nM
Citation
 Picaud, SLeonards, KLambert, JPDovey, OWells, CFedorov, OMonteiro, OFujisawa, TWang, CYLingard, HTallant, CNikbin, NGuetzoyan, LIngham, RLey, SVBrennan, PMuller, SSamsonova, AGingras, ACSchwaller, JVassiliou, GKnapp, SFilippakopoulos, P Promiscuous targeting of bromodomains by bromosporine identifies BET proteins as master regulators of primary transcription response in leukemia. Sci Adv 2:0 (2016) Target
Name:
Histone acetyltransferase KAT2B
Synonyms:
Histone acetyltransferase KAT2A/KAT2B KAT2B PCAF
Type:
PROTEIN
Mol. Mass.:
93045.76
Organism:
Homo sapiens (Human)
Description:
ChEMBL_1502838
Residue:
832
  
Inhibitor
Name:
BDBM50504160
Synonyms:
CHEMBL3133807 | US11773085, Compound B25
Type:
Small organic molecule
Emp. Form.:
C17H20N6O4S
Mol. Mass.:
404.444
SMILES:
CCOC(=O)Nc1cc(nn2c(C)nnc12)-c1ccc(C)c(NS(C)(=O)=O)c1
: