Target
Dual specificity protein kinase CLK1
Ligand
BDBM50249762
Substrate
Meas. Tech.
ChEMBL_2012563 (CHEMBL4666141)
IC50
120±n/a nM
Citation
 Tazarki, HZeinyeh, WEsvan, YJKnapp, SChatterjee, DSchröder, MJoerger, ACKhiari, JJosselin, BBaratte, BBach, SRuchaud, SAnizon, FGiraud, FMoreau, P New pyrido[3,4-g]quinazoline derivatives as CLK1 and DYRK1A inhibitors: synthesis, biological evaluation and binding mode analysis. Eur J Med Chem 166:304-317 (2019)  
Target
Name:
Dual specificity protein kinase CLK1
Synonyms:
CDC-like kinase 1 Clk Protein kinase STY | Sty
Type:
PROTEIN
Mol. Mass.:
57124.52
Organism:
Mus musculus
Description:
ChEMBL_1502245
Residue:
483
  
Inhibitor
Name:
BDBM50249762
Synonyms:
CHEMBL4759771
Type:
Small organic molecule
Emp. Form.:
C16H20N6
Mol. Mass.:
296.3702
SMILES:
CN(C)CCCNc1ncc2cc3cnccc3c(N)c2n1
: