Target
Cytochrome P450 2C9
Ligand
BDBM50546134
Substrate
Meas. Tech.
ChEMBL_2014366 (CHEMBL4667944)
IC50
36600±n/a nM
Citation
 Meyers, MJLiu, JLiu, ZMa, HDai, LAdah, DZhao, SLi, XLiu, XLu, YHuang, YTu, ZChen, XTortorella, MD 4-Aryl Pyrrolidines as Novel Orally Efficacious Antimalarial Agents. Part 2: 2-Aryl- ACS Med Chem Lett 10:966-971 (2019)  
Target
Name:
Cytochrome P450 2C9
Synonyms:
(R)-limonene 6-monooxygenase CP2C9_HUMAN CYP2C9 Cytochrome P450 2C9 (CYP2C9 ) P-450MP P450 PB-1 | S-mephenytoin 4-hydroxylase
Type:
Enzyme
Mol. Mass.:
55636.33
Organism:
Homo sapiens (Human)
Description:
P11712
Residue:
490
  
Inhibitor
Name:
BDBM50546134
Synonyms:
CHEMBL4755729
Type:
Small organic molecule
Emp. Form.:
C20H24F5N3OS
Mol. Mass.:
449.481
SMILES:
CN(C)c1ccc(CC(=O)N[C@@H]2CNC[C@H]2c2ccc(cc2)S(F)(F)(F)(F)F)cc1
: