Target
Cytochrome P450 1A2
Ligand
BDBM50546134
Substrate
Meas. Tech.
ChEMBL_2014368 (CHEMBL4667946)
IC50
>100000±n/a nM
Citation
 Meyers, MJLiu, JLiu, ZMa, HDai, LAdah, DZhao, SLi, XLiu, XLu, YHuang, YTu, ZChen, XTortorella, MD 4-Aryl Pyrrolidines as Novel Orally Efficacious Antimalarial Agents. Part 2: 2-Aryl- ACS Med Chem Lett 10:966-971 (2019)  
Target
Name:
Cytochrome P450 1A2
Synonyms:
CP1A2_HUMAN CYPIA2 Cytochrome P(3)450 Cytochrome P450 1A2 (CYP1A2) Cytochrome P450-P3
Type:
Enzyme
Mol. Mass.:
58423.38
Organism:
Homo sapiens (Human)
Description:
P05177
Residue:
516
  
Inhibitor
Name:
BDBM50546134
Synonyms:
CHEMBL4755729
Type:
Small organic molecule
Emp. Form.:
C20H24F5N3OS
Mol. Mass.:
449.481
SMILES:
CN(C)c1ccc(CC(=O)N[C@@H]2CNC[C@H]2c2ccc(cc2)S(F)(F)(F)(F)F)cc1
: