Target
Cytochrome P450 3A4
Ligand
BDBM50546133
Substrate
Meas. Tech.
ChEMBL_2014369 (CHEMBL4667947)
IC50
871±n/a nM
Citation
 Meyers, MJLiu, JLiu, ZMa, HDai, LAdah, DZhao, SLi, XLiu, XLu, YHuang, YTu, ZChen, XTortorella, MD 4-Aryl Pyrrolidines as Novel Orally Efficacious Antimalarial Agents. Part 2: 2-Aryl- ACS Med Chem Lett 10:966-971 (2019)  
Target
Name:
Cytochrome P450 3A4
Synonyms:
Albendazole monooxygenase CP3A4_HUMAN CYP3A4 CYPIIIA4 Cytochrome P450 3A4 (CYP3A4) Nifedipine oxidase Taurochenodeoxycholate 6-alpha-hydroxylase
Type:
Enzyme
Mol. Mass.:
57349.57
Organism:
Homo sapiens (Human)
Description:
Residue:
503
  
Inhibitor
Name:
BDBM50546133
Synonyms:
CHEMBL4750688
Type:
Small organic molecule
Emp. Form.:
C21H24F3N3O
Mol. Mass.:
391.43
SMILES:
CN(C)c1ccc(CC(=O)N[C@@H]2CNC[C@H]2c2ccc(cc2)C(F)(F)F)cc1
: