Target
Potassium voltage-gated channel subfamily H member 2
Ligand
BDBM50546135
Substrate
Meas. Tech.
ChEMBL_2014372 (CHEMBL4667950)
IC50
2809±n/a nM
Citation
 Meyers, MJLiu, JLiu, ZMa, HDai, LAdah, DZhao, SLi, XLiu, XLu, YHuang, YTu, ZChen, XTortorella, MD 4-Aryl Pyrrolidines as Novel Orally Efficacious Antimalarial Agents. Part 2: 2-Aryl- ACS Med Chem Lett 10:966-971 (2019)  
Target
Name:
Potassium voltage-gated channel subfamily H member 2
Synonyms:
1,3-beta-glucan synthase component GLS2 ERG Eag-related protein 1 Ether-a-go-go-related gene (HERG) Ether-a-go-go-related gene potassium channel 1 Ether-a-go-go-related gene potassium channel 1 (hERG1) Ether-a-go-go-related protein 1 H-ERG KCNH2 Potassium voltage-gated channel subfamily H member 2 (hERG) Voltage-gated potassium channel subunit Kv11.1 hERG Potassium Channel 1 | putative potassium channel subunit
Type:
Multi-pass membrane protein
Mol. Mass.:
126672.65
Organism:
Homo sapiens (Human)
Description:
Q12809
Residue:
1159
  
Inhibitor
Name:
BDBM50546135
Synonyms:
CHEMBL4759278
Type:
Small organic molecule
Emp. Form.:
C22H27F2N3O
Mol. Mass.:
387.4661
SMILES:
CN(C)c1ccc(CC(=O)N[C@@H]2CNC[C@H]2c2ccc(cc2)C(C)(F)F)cc1
: