Target
Integrin alpha-IIb/beta-3
Ligand
BDBM50104590
Substrate
Meas. Tech.
ChEMBL_90021 (CHEMBL699520)
IC50
0.600000±n/a nM
Citation
 Lawson, ECHoekstra, WJAddo, MFAndrade-Gordon, PDamiano, BPKauffman, JAMitchell, JAMaryanoff, BE 1,2,4-triazolo[3,4-a]pyridine as a novel, constrained template for fibrinogen receptor (GPIIb/IIIa) antagonists. Bioorg Med Chem Lett 11:2619-22 (2001)  
Target
Name:
Integrin alpha-IIb/beta-3
Synonyms:
Glycoprotein IIb/IIIa
Type:
Mol. Mass.:
Description:
ASSAY_ID of EBI is 30109
Components:
This complex has 2 components.
Component 1
Name:
Integrin beta-3
Synonyms:
CD_antigen=CD61 GPIIIa ITGB3 Platelet membrane glycoprotein IIIa
Type:
Protein
Mol. Mass.:
87038.91
Organism:
Homo sapiens (Human)
Description:
P05106
Residue:
788
  
Component 2
Name:
Integrin alpha-IIb
Synonyms:
CD_antigen=CD41 GPIIb Glycoprotein IIb ITGA2B Integrin alpha-IIb heavy chain Integrin alpha-IIb light chain, form 2 Integrin alpha-V/beta-3 and alpha-IIb/beta 3 | Platelet membrane glycoprotein IIb
Type:
Protein
Mol. Mass.:
113354.85
Organism:
Homo sapiens (Human)
Description:
P08514
Residue:
1039
  
Inhibitor
Name:
BDBM50104590
Synonyms:
2-Isobutoxycarbonylamino-3-{[3-(2-piperidin-4-yl-vinyl)-5,6,7,8-tetrahydro-[1,2,4]triazolo[4,3-a]pyridine-8-carbonyl]-amino}-propionic acid | CHEMBL314318
Type:
Small organic molecule
Emp. Form.:
C22H34N6O5
Mol. Mass.:
462.5426
SMILES:
CC(C)COC(=O)N[C@@H](CNC(=O)C1CCCn2c(C=CC3CCNCC3)nnc12)C(O)=O
: