Target
Sodium/hydrogen exchanger 2
Ligand
BDBM50058715
Substrate
Meas. Tech.
ChEMBL_141048 (CHEMBL872728)
IC50
17000±n/a nM
Citation
 Ahmad, SDoweyko, LMDugar, SGrazier, NNgu, KWu, SCYost, KJChen, BCGougoutas, JZDiMarco, JDLan, SJGavin, BJChen, AYDorso, CRSerafino, RKirby, MAtwal, KS Arylcyclopropanecarboxyl guanidines as novel, potent, and selective inhibitors of the sodium hydrogen exchanger isoform-1. J Med Chem 44:3302-10 (2001)  
Target
Name:
Sodium/hydrogen exchanger 2
Synonyms:
NHE-2 Na(+)/H(+) exchanger 2 SLC9A2 | Solute carrier family 9 member 2
Type:
PROTEIN
Mol. Mass.:
91542.38
Organism:
Homo sapiens (Human)
Description:
ChEMBL_397781
Residue:
812
  
Inhibitor
Name:
BDBM50058715
Synonyms:
CHEMBL64360 ENIPORIDE N-(5-Methanesulfonyl-2-methyl-4-pyrrol-1-yl-benzoyl)-guanidine (Eniporide, EMD-96-875) | N-(diaminomethylene)-2-methyl-5-(methylsulfonyl)-4-(1H-pyrrol-1-yl)benzamide
Type:
Small organic molecule
Emp. Form.:
C14H16N4O3S
Mol. Mass.:
320.367
SMILES:
Cc1cc(c(cc1C(=O)NC(N)=N)S(C)(=O)=O)-n1cccc1
: