Target
C-C chemokine receptor type 5
Ligand
BDBM50104940
Substrate
Meas. Tech.
ChEMBL_39638 (CHEMBL649944)
Ki
1.1±n/a nM
Citation
 Palani, AShapiro, SClader, JWGreenlee, WJCox, KStrizki, JEndres, MBaroudy, BM Discovery of 4-[(Z)-(4-bromophenyl)- (ethoxyimino)methyl]-1'-[(2,4-dimethyl-3- pyridinyl)carbonyl]-4'-methyl-1,4'- bipiperidine N-oxide (SCH 351125): an orally bioavailable human CCR5 antagonist for the treatment of HIV infection. J Med Chem 44:3339-42 (2001)  
Target
Name:
C-C chemokine receptor type 5
Synonyms:
C-C CKR-5 CC-CKR-5 CCR5 CCR5_HUMAN CHEMR13 HIV-1 fusion coreceptor
Type:
Enzyme
Mol. Mass.:
40540.21
Organism:
Homo sapiens (Human)
Description:
P51681
Residue:
352
  
Inhibitor
Name:
BDBM50104940
Synonyms:
CHEMBL323172 | {4-[(4-Bromo-phenyl)-methoxyimino-methyl]-4'-methyl-[1,4']bipiperidinyl-1'-yl}-(2,4-dimethyl-pyridin-3-yl)-methanone
Type:
Small organic molecule
Emp. Form.:
C27H35BrN4O2
Mol. Mass.:
527.496
SMILES:
CO\N=C(\C1CCN(CC1)C1(C)CCN(CC1)C(=O)c1c(C)ccnc1C)c1ccc(Br)cc1
: