Target
Tyrosyl-DNA phosphodiesterase 1
Ligand
BDBM50546512
Substrate
Meas. Tech.
ChEMBL_2016084 (CHEMBL4669662)
IC50
27±n/a nM
Citation
 Luzina, OFilimonov, AZakharenko, AChepanova, AZakharova, OIlina, EDyrkheeva, NLikhatskaya, GSalakhutdinov, NLavrik, O Usnic Acid Conjugates with Monoterpenoids as Potent Tyrosyl-DNA Phosphodiesterase 1 Inhibitors. J Nat Prod 83:2320-2329 (2020)  
Target
Name:
Tyrosyl-DNA phosphodiesterase 1
Synonyms:
TDP1 Tyrosyl-DNA phosphodiesterase 1 | Tyrosyl-DNA phosphodiesterase 1 (TDP1)
Type:
Enzyme
Mol. Mass.:
68430.66
Organism:
Homo sapiens (Human)
Description:
Q9NUW8
Residue:
608
  
Inhibitor
Name:
BDBM50546512
Synonyms:
CHEMBL4799682
Type:
Small organic molecule
Emp. Form.:
C29H29N3O6S
Mol. Mass.:
547.622
SMILES:
CC(=C)[C@@H]1CCC(\C=N/Nc2nc(cs2)-c2c3OC4=CC(O)=C(C(C)=O)C(=O)[C@]4(C)c3c(O)c(C)c2O)=CC1
: