Target
Rho-associated protein kinase 1
Ligand
BDBM14027
Substrate
Meas. Tech.
ChEMBL_2016259 (CHEMBL4669837)
IC50
940±n/a nM
Citation
 Hu, ZWang, CSitkoff, DCheadle, NLXu, SMuckelbauer, JKAdam, LPWexler, RRQuan, ML Identification of 5H-chromeno[3,4-c]pyridine and 6H-isochromeno[3,4-c]pyridine derivatives as potent and selective dual ROCK inhibitors. Bioorg Med Chem Lett 30:127474 (2020)  
Target
Name:
Rho-associated protein kinase 1
Synonyms:
ROCK-I ROCK1_HUMAN Rho-associated protein kinase Rho-associated, coiled-coil-containing protein kinase 1 Rho-kinase (ROCK I) p160 ROCK-1 | p160ROCK
Type:
Serine/threonine-protein kinase
Mol. Mass.:
158156.77
Organism:
Homo sapiens (Human)
Description:
Q13464
Residue:
1354
  
Inhibitor
Name:
BDBM14027
Synonyms:
5-(1,4-diazepan-1-ylsulfonyl)isoquinoline AT877 CHEMBL541388 HA-1077 cid_163751
Type:
Small organic molecule
Emp. Form.:
C14H17N3O2S
Mol. Mass.:
291.369
SMILES:
O=S(=O)(N1CCCNCC1)c1cccc2cnccc12
: