Target
Telomeric repeat-binding factor 2
Ligand
BDBM50338579
Substrate
Meas. Tech.
ChEMBL_2016709 (CHEMBL4670287)
Ki
90±n/a nM
Citation
 Chen, XDong, YGuo, TYang, CYChen, YSun, H N-terminal modified cyclopeptidic mimetics of Apollo Bioorg Med Chem Lett 30:127401 (2020) Target
Name:
Telomeric repeat-binding factor 2
Synonyms:
TERF2 TRBF2 TTAGGG repeat-binding factor 2 Telomeric repeat-binding factor 2
Type:
PROTEIN
Mol. Mass.:
59608.94
Organism:
Homo sapiens
Description:
ChEMBL_118257
Residue:
542
  
Inhibitor
Name:
BDBM50338579
Synonyms:
CHEMBL4166000
Type:
Small organic molecule
Emp. Form.:
C59H98N12O12
Mol. Mass.:
1167.4826
SMILES:
CC(C)C[C@H](NC(C)=O)C(=O)N[C@@H](C)C(=O)N[C@@H](CC(C)C)C(=O)N[C@@H](CCCCN)C(=O)N[C@@H](Cc1ccc(O)cc1)C(=O)N[C@H]1CCCCCCC[C@H](NC(=O)[C@@H]2CCCN2C(=O)[C@H](C)NC(=O)[C@H](CC(C)C)NC1=O)C(=O)N(C)C
: