Target
Telomeric repeat-binding factor 2
Ligand
BDBM50546774
Substrate
Meas. Tech.
ChEMBL_2016709 (CHEMBL4670287)
Ki
8800±n/a nM
Citation
 Chen, XDong, YGuo, TYang, CYChen, YSun, H N-terminal modified cyclopeptidic mimetics of Apollo Bioorg Med Chem Lett 30:127401 (2020) Target
Name:
Telomeric repeat-binding factor 2
Synonyms:
TERF2 TRBF2 TTAGGG repeat-binding factor 2 Telomeric repeat-binding factor 2
Type:
PROTEIN
Mol. Mass.:
59608.94
Organism:
Homo sapiens
Description:
ChEMBL_118257
Residue:
542
  
Inhibitor
Name:
BDBM50546774
Synonyms:
CHEMBL4779157
Type:
Small organic molecule
Emp. Form.:
C42H58N6O12
Mol. Mass.:
838.9429
SMILES:
[H][C@@]12CCCN1C(=O)[C@H](C)NC(=O)[C@H](CC(C)C)NC(=O)[C@H](COCCCCOC[C@H](NC2=O)C(=O)N(C)C)NC(=O)c1cc(OCC(O)=O)cc(OCc2ccccc2)c1
: