Target
Telomeric repeat-binding factor 2
Ligand
BDBM50546785
Substrate
Meas. Tech.
ChEMBL_2016709 (CHEMBL4670287)
Ki
39000±n/a nM
Citation
 Chen, XDong, YGuo, TYang, CYChen, YSun, H N-terminal modified cyclopeptidic mimetics of Apollo Bioorg Med Chem Lett 30:127401 (2020) Target
Name:
Telomeric repeat-binding factor 2
Synonyms:
TERF2 TRBF2 TTAGGG repeat-binding factor 2 Telomeric repeat-binding factor 2
Type:
PROTEIN
Mol. Mass.:
59608.94
Organism:
Homo sapiens
Description:
ChEMBL_118257
Residue:
542
  
Inhibitor
Name:
BDBM50546785
Synonyms:
CHEMBL4756877
Type:
Small organic molecule
Emp. Form.:
C42H60N6O9
Mol. Mass.:
792.9606
SMILES:
[H][C@@]12CCCN1C(=O)[C@H](C)NC(=O)[C@H](CC(C)C)NC(=O)[C@H](COCCCCOC[C@H](NC2=O)C(=O)N(C)C)NC(=O)c1cccc(OCCCc2ccccc2)c1
: