Target
Thyroid hormone receptor beta
Ligand
BDBM50547824
Substrate
Meas. Tech.
ChEMBL_2019091 (CHEMBL4672669)
IC50
0.500000±n/a nM
Citation
 Hillisch, AGericke, KMAllerheiligen, SRoehrig, SSchaefer, MTersteegen, ASchulz, SLienau, PGnoth, MPuetter, VHillig, RCHeitmeier, S Design, Synthesis, and Pharmacological Characterization of a Neutral, Non-Prodrug Thrombin Inhibitor with Good Oral Pharmacokinetics. J Med Chem 63:12574-12594 (2020)  
Target
Name:
Thyroid hormone receptor beta
Synonyms:
ERBA2 Nuclear receptor subfamily 1 group A member 2 THR1 c-erbA-2 | c-erbA-beta
Type:
Receptor
Mol. Mass.:
52793.62
Organism:
Homo sapiens (Human)
Description:
Recombinant hThR was obtained from nuclear extracts from SF9 cells infected with baculovirus vectors encoding for ThRbeta 1.
Residue:
461
  
Inhibitor
Name:
BDBM50547824
Synonyms:
CHEMBL4754786
Type:
Small organic molecule
Emp. Form.:
C25H30ClN3O5
Mol. Mass.:
487.976
SMILES:
COc1cc(cc2nc(N[C@H](C)c3cccc(Cl)c3)oc12)C(=O)N1CC(C)(CCO)OC[C@H]1C
: