Target
Dimer of Protein farnesyltransferase subunit beta
Ligand
BDBM50108067
Substrate
Meas. Tech.
ChEMBL_70447 (CHEMBL680080)
IC50
30±n/a nM
Citation
 Ohkanda, JLockman, JWKothare, MAQian, YBlaskovich, MASebti, SMHamilton, AD Design and synthesis of potent nonpeptidic farnesyltransferase inhibitors based on a terphenyl scaffold. J Med Chem 45:177-88 (2001)  
Target
Name:
Dimer of Protein farnesyltransferase subunit beta
Synonyms:
Protein Farnesyltransferase (PFT) Chain B
Type:
Mol. Mass.:
Description:
ASSAY_ID of EBI is 51428
Components:
This complex has 3 components.
Component 1
Name:
Protein farnesyltransferase subunit beta
Synonyms:
CAAX farnesyltransferase subunit alpha FNTB FTase-alpha GGTase-I-alpha Protein farnesyl/geranylgeranyl transferase Protein farnesyltransferase subunit beta Protein farnesyltransferase/geranylgeranyltransferase type-1 subunit alpha Ras proteins prenyltransferase subunit beta | Type I protein geranyl-geranyltransferase subunit alpha
Type:
Enzyme Subunit
Mol. Mass.:
48766.02
Organism:
Homo sapiens (Human)
Description:
Protein farnesyltransferase subunit beta
Residue:
437
  
Component 2
Name:
Protein farnesyltransferase subunit beta
Synonyms:
CAAX farnesyltransferase subunit alpha FNTB FTase-alpha GGTase-I-alpha Protein farnesyl/geranylgeranyl transferase Protein farnesyltransferase subunit beta Protein farnesyltransferase/geranylgeranyltransferase type-1 subunit alpha Ras proteins prenyltransferase subunit beta | Type I protein geranyl-geranyltransferase subunit alpha
Type:
Enzyme Subunit
Mol. Mass.:
48766.02
Organism:
Homo sapiens (Human)
Description:
Protein farnesyltransferase subunit beta
Residue:
437
  
Inhibitor
Name:
BDBM50108067
Synonyms:
2-Amino-3-[3'-(5H-tetrazol-5-yl)-biphenyl-4-ylamino]-propane-1-thiol 8(FTI-2102) | CHEMBL55639
Type:
Small organic molecule
Emp. Form.:
C16H18N6S
Mol. Mass.:
326.419
SMILES:
N[C@@H](CS)CNc1ccc(cc1)-c1cccc(c1)-c1nnn[nH]1
: