Target
Dimer of Protein farnesyltransferase subunit beta
Ligand
BDBM50108055
Substrate
Meas. Tech.
ChEMBL_70447 (CHEMBL680080)
IC50
380±n/a nM
Citation
 Ohkanda, JLockman, JWKothare, MAQian, YBlaskovich, MASebti, SMHamilton, AD Design and synthesis of potent nonpeptidic farnesyltransferase inhibitors based on a terphenyl scaffold. J Med Chem 45:177-88 (2001)  
Target
Name:
Dimer of Protein farnesyltransferase subunit beta
Synonyms:
Protein Farnesyltransferase (PFT) Chain B
Type:
Mol. Mass.:
Description:
ASSAY_ID of EBI is 51428
Components:
This complex has 3 components.
Component 1
Name:
Protein farnesyltransferase subunit beta
Synonyms:
CAAX farnesyltransferase subunit alpha FNTB FTase-alpha GGTase-I-alpha Protein farnesyl/geranylgeranyl transferase Protein farnesyltransferase subunit beta Protein farnesyltransferase/geranylgeranyltransferase type-1 subunit alpha Ras proteins prenyltransferase subunit beta | Type I protein geranyl-geranyltransferase subunit alpha
Type:
Enzyme Subunit
Mol. Mass.:
48766.02
Organism:
Homo sapiens (Human)
Description:
Protein farnesyltransferase subunit beta
Residue:
437
  
Component 2
Name:
Protein farnesyltransferase subunit beta
Synonyms:
CAAX farnesyltransferase subunit alpha FNTB FTase-alpha GGTase-I-alpha Protein farnesyl/geranylgeranyl transferase Protein farnesyltransferase subunit beta Protein farnesyltransferase/geranylgeranyltransferase type-1 subunit alpha Ras proteins prenyltransferase subunit beta | Type I protein geranyl-geranyltransferase subunit alpha
Type:
Enzyme Subunit
Mol. Mass.:
48766.02
Organism:
Homo sapiens (Human)
Description:
Protein farnesyltransferase subunit beta
Residue:
437
  
Inhibitor
Name:
BDBM50108055
Synonyms:
4'-{[3-(4-Cyano-benzyl)-3H-imidazol-4-ylmethyl]-amino}-[1,1';2',1'']terphenyl-3-carboxylic acid methyl ester 25(FTI-2297) | CHEMBL292361
Type:
Small organic molecule
Emp. Form.:
C32H26N4O2
Mol. Mass.:
498.5744
SMILES:
COC(=O)c1cccc(c1)-c1ccc(NCc2cncn2Cc2ccc(cc2)C#N)cc1-c1ccccc1
: