Target
Maltase-glucoamylase
Ligand
BDBM50330955
Substrate
Meas. Tech.
ChEMBL_2025601 (CHEMBL4679414)
IC50
4900±n/a nM
Citation
 Takashima, KSakano, MKinouchi, ENakamura, SMarumoto, SIshikawa, FNinomiya, KNakanishi, IMorikawa, TTanabe, G Elongation of the side chain by linear alkyl groups increases the potency of salacinol, a potent ?-glucosidase inhibitor from the Ayurvedic traditional medicine "Salacia," against human intestinal maltase. Bioorg Med Chem Lett 33:0 (2021)  
Target
Name:
Maltase-glucoamylase
Synonyms:
Alpha glucosidase Glucan 1,4-alpha-glucosidase MGAM MGA_HUMAN Maltase-glucoamylase, intestinal | Synonyms=MGA
Type:
Enzyme
Mol. Mass.:
209817.06
Organism:
Homo sapiens (Human)
Description:
O43451
Residue:
2753
  
Inhibitor
Name:
BDBM50330955
Synonyms:
(1S,2S)-3-[(2R,3S,4S)-3,4-dihydroxy-2-(hydroxymethyl)tetrahydrothiophenium-1-yl]-2-hydroxy-1-(hydroxymethyl)propyl sulfate CHEMBL1208974 | salacinol
Type:
Small organic molecule
Emp. Form.:
C9H18O9S2
Mol. Mass.:
334.364
SMILES:
OC[C@H](OS([O-])(=O)=O)[C@H](O)C[S@@+]1C[C@@H](O)[C@H](O)[C@H]1CO
: