Target
DNA polymerase beta
Ligand
BDBM50109030
Substrate
Meas. Tech.
ChEMBL_50294 (CHEMBL660414)
IC50
11000±n/a nM
Citation
 Watanabe, MHanashima, SMizushina, YYoshida, HOshige, MSakaguchi, KSugawara, F Biotinylated lithocholic acids for affinity chromatography of mammalian DNA polymerases alpha and beta. Bioorg Med Chem Lett 12:287-90 (2002)  
Target
Name:
DNA polymerase beta
Synonyms:
DNA Polymerase beta Polb
Type:
PROTEIN
Mol. Mass.:
38334.34
Organism:
Rattus norvegicus
Description:
ChEMBL_1361926
Residue:
335
  
Inhibitor
Name:
BDBM50109030
Synonyms:
4-(3-Hydroxy-10,13-dimethyl-hexadecahydro-cyclopenta[a]phenanthren-17-yl)-pentanoic acid | CHEMBL3138225
Type:
Small organic molecule
Emp. Form.:
C24H40O3
Mol. Mass.:
376.5726
SMILES:
[H][C@@](C)(CCC(O)=O)[C@@]1([H])CC[C@@]2([H])[C@]3([H])CCC4C[C@@H](O)CC[C@]4(C)[C@@]3([H])CC[C@]12C
: