Target
Neuropeptide Y receptor type 1
Ligand
BDBM50109180
Substrate
Meas. Tech.
ChEBML_143825
Ki
108±n/a nM
Citation
 Poindexter, GSBruce, MALeBoulluec, KLMonkovic, IMartin, SWParker, EMIben, LGMcGovern, RTOrtiz, AAStanley, JAMattson, GKKozlowski, MArcuri, MAntal-Zimanyi, I Dihydropyridine neuropeptide Y Y(1) receptor antagonists. Bioorg Med Chem Lett 12:379-82 (2002)  
Target
Name:
Neuropeptide Y receptor type 1
Synonyms:
NPY-Y1 NPY1R NPYR neuropeptide Y receptor Y1
Type:
Enzyme Catalytic Domain
Mol. Mass.:
44399.07
Organism:
Homo sapiens (Human)
Description:
NPY-Y1 NPY1R HUMAN::P25929
Residue:
384
  
Inhibitor
Name:
BDBM50109180
Synonyms:
4-[3-(3-{3-[4-(2-Hydroxy-phenyl)-piperazin-1-yl]-propyl}-ureido)-phenyl]-2,6-dimethyl-1,4-dihydro-pyridine-3,5-dicarboxylic acid 3-ethyl ester 5-methyl ester | CHEMBL124335
Type:
Small organic molecule
Emp. Form.:
C32H41N5O6
Mol. Mass.:
591.6978
SMILES:
CCOC(=O)C1=C(C)N=C(C)C(C1c1cccc(NC(=O)NCCCN2CCN(CC2)c2ccccc2O)c1)C(=O)OC
: