Target
Neuropeptide Y receptor type 1
Ligand
BDBM50109122
Substrate
Meas. Tech.
ChEBML_143825
Ki
3.3±n/a nM
Citation
 Poindexter, GSBruce, MALeBoulluec, KLMonkovic, IMartin, SWParker, EMIben, LGMcGovern, RTOrtiz, AAStanley, JAMattson, GKKozlowski, MArcuri, MAntal-Zimanyi, I Dihydropyridine neuropeptide Y Y(1) receptor antagonists. Bioorg Med Chem Lett 12:379-82 (2002)  
Target
Name:
Neuropeptide Y receptor type 1
Synonyms:
NPY-Y1 NPY1R NPYR neuropeptide Y receptor Y1
Type:
Enzyme Catalytic Domain
Mol. Mass.:
44399.07
Organism:
Homo sapiens (Human)
Description:
NPY-Y1 NPY1R HUMAN::P25929
Residue:
384
  
Inhibitor
Name:
BDBM50109122
Synonyms:
4-[3-(3-{3-[4-(3-Methoxy-phenyl)-piperidin-1-yl]-propyl}-ureido)-phenyl]-2,6-dimethyl-1,4-dihydro-pyridine-3,5-dicarboxylic acid dimethyl ester CHEMBL324554
Type:
Small organic molecule
Emp. Form.:
C33H42N4O6
Mol. Mass.:
590.7098
SMILES:
COC(=O)C1C(C(C(=O)OC)=C(C)N=C1C)c1cccc(NC(=O)NCCCN2CCC(CC2)c2cccc(OC)c2)c1
: