Target
Histone deacetylase 1
Ligand
BDBM50322422
Substrate
Meas. Tech.
ChEMBL_2027488 (CHEMBL4681646)
IC50
61±n/a nM
Citation
 Almaliti, JAl-Hamashi, AANegmeldin, ATHanigan, CLPerera, LPflum, MKCasero, RATillekeratne, LM Largazole Analogues Embodying Radical Changes in the Depsipeptide Ring: Development of a More Selective and Highly Potent Analogue. J Med Chem 59:10642-10660 (2016)  
Target
Name:
Histone deacetylase 1
Synonyms:
Cereblon/Histone deacetylase 1 HDAC1 Histone deacetylase 1 (HDAC1) RPD3L1
Type:
Enzyme
Mol. Mass.:
55090.27
Organism:
Homo sapiens (Human)
Description:
Q13547
Residue:
482
  
Inhibitor
Name:
BDBM50322422
Synonyms:
CHEMBL1173445 | Largazole
Type:
Small organic molecule
Emp. Form.:
C29H42N4O5S3
Mol. Mass.:
622.863
SMILES:
CCCCCCCC(=O)SCC\C=C\[C@@H]1CC(=O)NCc2nc(cs2)C2=N[C@@](C)(CS2)C(=O)N[C@@H](C(C)C)C(=O)O1
: