Target
Multidrug resistance-associated protein 1
Ligand
BDBM50109810
Substrate
Meas. Tech.
ChEBML_43631
IC50
>10000±n/a nM
Citation
 Wang, SRyder, HPretswell, IDepledge, PMilton, JHancox, TCDale, IDangerfield, WCharlton, PFaint, RDodd, RHassan, S Studies on quinazolinones as dual inhibitors of Pgp and MRP1 in multidrug resistance. Bioorg Med Chem Lett 12:571-4 (2002)  
Target
Name:
Multidrug resistance-associated protein 1
Synonyms:
7.6.2.2 ABCC1 ATP-binding cassette, sub-family C, member 1 isoform 1 LTC4 transporter MRP MRP1_HUMAN
Type:
Mol. Mass.:
171597.72
Organism:
Homo sapiens (Human)
Description:
P33527
Residue:
1531
  
Inhibitor
Name:
BDBM50109810
Synonyms:
2-(4-Diethylamino-phenyl)-3-[2-(6,7-dimethoxy-3,4-dihydro-1H-isoquinolin-2-yl)-ethyl]-3H-quinazolin-4-one | CHEMBL345316
Type:
Small organic molecule
Emp. Form.:
C31H36N4O3
Mol. Mass.:
512.6425
SMILES:
CCN(CC)c1ccc(cc1)-c1nc2ccccc2c(=O)n1CCN1CCc2cc(OC)c(OC)cc2C1
: