Target
Adenosine receptor A1
Ligand
BDBM50550819
Substrate
Meas. Tech.
ChEMBL_2028586 (CHEMBL4682744)
Ki
0.348000±n/a nM
Citation
 Abdelrahman, AYerande, SGNamasivayam, VKlapschinski, TAAlnouri, MWEl-Tayeb, AMüller, CE Substituted 4-phenylthiazoles: Development of potent and selective A Eur J Med Chem 186:0 (2020)  
Target
Name:
Adenosine receptor A1
Synonyms:
AA1R_RAT ADENOSINE A1 high Adenosine A1 receptor (A1) Adenosine receptors A1 | Adora1
Type:
Protein
Mol. Mass.:
36704.13
Organism:
Rattus norvegicus (rat)
Description:
Residue:
326
  
Inhibitor
Name:
BDBM50550819
Synonyms:
CHEMBL4796077
Type:
Small organic molecule
Emp. Form.:
C22H16N2O3S
Mol. Mass.:
388.439
SMILES:
Cc1ccc(cc1)C(=O)c1sc(NC(=O)c2ccco2)nc1-c1ccccc1
: