Target
Histamine H3 receptor
Ligand
BDBM50110309
Substrate
Meas. Tech.
ChEMBL_85818 (CHEMBL697095)
Ki
411.0±n/a nM
Citation
 Apelt, JLigneau, XPertz, HHArrang, JMGanellin, CRSchwartz, JCSchunack, WStark, H Development of a new class of nonimidazole histamine H(3) receptor ligands with combined inhibitory histamine N-methyltransferase activity. J Med Chem 45:1128-41 (2002)  
Target
Name:
Histamine H3 receptor
Synonyms:
G-protein coupled receptor 97 HH3R HRH3 Histamine H3 receptor (H3) Histamine receptor (H3 and H4)
Type:
G Protein-Coupled Receptor (GPCR)
Mol. Mass.:
48691.47
Organism:
Homo sapiens (Human)
Description:
Binding assays were using CHO cells stably expressing hH3R receptors.
Residue:
445
  
Inhibitor
Name:
BDBM50110309
Synonyms:
CHEMBL14740 | Methyl-(3-piperidin-1-yl-propyl)-quinolin-4-yl-amine; Oxalic acid
Type:
Small organic molecule
Emp. Form.:
C18H25N3
Mol. Mass.:
283.4112
SMILES:
CN(CCCN1CCCCC1)c1ccnc2ccccc12
: