Target
Prostaglandin G/H synthase 2
Ligand
BDBM50038649
Substrate
Meas. Tech.
ChEMBL_2030485 (CHEMBL4684643)
IC50
450±n/a nM
Citation
 Gedawy, EMKassab, AEEl Kerdawy, AM Design, synthesis and biological evaluation of novel pyrazole sulfonamide derivatives as dual COX-2/5-LOX inhibitors. Eur J Med Chem 189:0 (2020)  
Target
Name:
Prostaglandin G/H synthase 2
Synonyms:
COX2 Cyclooxygenase 2 (COX-2) Cyclooxygenase-2 (COX-2 AA) Cyclooxygenase-2 (COX-2) PGH2_HUMAN PHS II Prostaglandin E synthase/G/H synthase 2 Prostaglandin-endoperoxide synthase 2
Type:
Enzyme
Mol. Mass.:
69003.89
Organism:
Homo sapiens (Human)
Description:
Recombinant Cox-2 provided by Cayman (Cayman Chemical Co.,Ann Arbor, MI).
Residue:
604
  
Inhibitor
Name:
BDBM50038649
Synonyms:
2-(6-(4-chlorophenyl)-2,2-dimethyl-7-phenyl-2,3-dihydro-1H-pyrrolizin-5-yl)acetic acid Licofelone [2-(4-Chloro-phenyl)-6,6-dimethyl-1-phenyl-6,7-dihydro-5H-pyrrolizin-3-yl]-acetic acid | [6-(4-CHLOROPHENYL)-2,2-DIMETHYL-7-PHENYL-2,3-DIHYDRO-1H-PYRROLIZIN-5-YL]ACETIC ACID
Type:
Small organic molecule
Emp. Form.:
C23H22ClNO2
Mol. Mass.:
379.879
SMILES:
CC1(C)Cc2c(c(c(CC(O)=O)n2C1)-c1ccc(Cl)cc1)-c1ccccc1
: