Target
Polyunsaturated fatty acid 5-lipoxygenase
Ligand
BDBM50038649
Substrate
Meas. Tech.
ChEMBL_2030487 (CHEMBL4684645)
IC50
510±n/a nM
Citation
 Gedawy, EMKassab, AEEl Kerdawy, AM Design, synthesis and biological evaluation of novel pyrazole sulfonamide derivatives as dual COX-2/5-LOX inhibitors. Eur J Med Chem 189:0 (2020)  
Target
Name:
Polyunsaturated fatty acid 5-lipoxygenase
Synonyms:
5-LO 5-Lipoxygenase (5-LO) 5-Lipoygenase ALOX5 LOG5 | LOX5_HUMAN
Type:
Enzyme
Mol. Mass.:
77972.74
Organism:
Homo sapiens (Human)
Description:
Recombinant protein was purified from E. coli lysate. After ammonium sulfate precipitation and subsequent steps, the supernatant (S100) was used for 5-LO activity assay.
Residue:
674
  
Inhibitor
Name:
BDBM50038649
Synonyms:
2-(6-(4-chlorophenyl)-2,2-dimethyl-7-phenyl-2,3-dihydro-1H-pyrrolizin-5-yl)acetic acid Licofelone [2-(4-Chloro-phenyl)-6,6-dimethyl-1-phenyl-6,7-dihydro-5H-pyrrolizin-3-yl]-acetic acid | [6-(4-CHLOROPHENYL)-2,2-DIMETHYL-7-PHENYL-2,3-DIHYDRO-1H-PYRROLIZIN-5-YL]ACETIC ACID
Type:
Small organic molecule
Emp. Form.:
C23H22ClNO2
Mol. Mass.:
379.879
SMILES:
CC1(C)Cc2c(c(c(CC(O)=O)n2C1)-c1ccc(Cl)cc1)-c1ccccc1
: