Target
Melatonin receptor type 1B
Ligand
BDBM50035179
Substrate
Meas. Tech.
ChEMBL_2030741 (CHEMBL4684899)
EC50
0.210000±n/a nM
Citation
 Bolteau, RDescamps, FEttaoussi, MCaignard, DHDelagrange, PMelnyk, PYous, S Quinazoline and phthalazine derivatives as novel melatonin receptor ligands analogues of agomelatine. Eur J Med Chem 189:0 (2020)  
Target
Name:
Melatonin receptor type 1B
Synonyms:
MTNR1B Mel-1B-R Melatonin 1B Melatonin receptor type 1B | Melatonin receptor type 2 (MT2)
Type:
Enzyme
Mol. Mass.:
40203.54
Organism:
Homo sapiens (Human)
Description:
P49286
Residue:
362
  
Inhibitor
Name:
BDBM50035179
Synonyms:
Agomelatine N-[2-(7-Methoxy-naphthalen-1-yl)-ethyl]-acetamide S 20098 US11091445, Compound code IA2-76
Type:
Small organic molecule
Emp. Form.:
C15H17NO2
Mol. Mass.:
243.301
SMILES:
COc1ccc2cccc(CCNC(C)=O)c2c1
: