Target
Coagulation factor X
Ligand
BDBM50038002
Substrate
Meas. Tech.
ChEMBL_49309 (CHEMBL663408)
Ki
200±n/a nM
Citation
 Liebeschuetz, JWJones, SDMorgan, PJMurray, CWRimmer, ADRoscoe, JMWaszkowycz, BWelsh, PMWylie, WAYoung, SCMartin, HMahler, JBrady, LWilkinson, K PRO_SELECT: combining structure-based drug design and array-based chemistry for rapid lead discovery. 2. The development of a series of highly potent and selective factor Xa inhibitors. J Med Chem 45:1221-32 (2002)  
Target
Name:
Coagulation factor X
Synonyms:
Activated coagulation factor X (FXa) Coagulation factor X precursor F10 Factor X heavy chain Factor Xa Stuart-Prower factor
Type:
Enzyme
Mol. Mass.:
54726.60
Organism:
Homo sapiens (Human)
Description:
Residue:
488
  
Inhibitor
Name:
BDBM50038002
Synonyms:
Benzamidine (Protonated) CHEMBL537204 | benzamidine
Type:
Small organic molecule
Emp. Form.:
C7H8N2
Mol. Mass.:
120.1518
SMILES:
NC(=N)c1ccccc1
: