Target
Coagulation factor X
Ligand
BDBM50110749
Substrate
Meas. Tech.
ChEMBL_49309 (CHEMBL663408)
Ki
220±n/a nM
Citation
 Liebeschuetz, JWJones, SDMorgan, PJMurray, CWRimmer, ADRoscoe, JMWaszkowycz, BWelsh, PMWylie, WAYoung, SCMartin, HMahler, JBrady, LWilkinson, K PRO_SELECT: combining structure-based drug design and array-based chemistry for rapid lead discovery. 2. The development of a series of highly potent and selective factor Xa inhibitors. J Med Chem 45:1221-32 (2002)  
Target
Name:
Coagulation factor X
Synonyms:
Activated coagulation factor X (FXa) Coagulation factor X precursor F10 Factor X heavy chain Factor Xa Stuart-Prower factor
Type:
Enzyme
Mol. Mass.:
54726.60
Organism:
Homo sapiens (Human)
Description:
Residue:
488
  
Inhibitor
Name:
BDBM50110749
Synonyms:
CHEMBL417827 | N-{[(4-Aminomethyl-cyclohexylmethyl)-carbamoyl]-phenyl-methyl}-3-carbamimidoyl-benzamide
Type:
Small organic molecule
Emp. Form.:
C24H31N5O2
Mol. Mass.:
421.5352
SMILES:
NCC1CCC(CNC(=O)[C@H](NC(=O)c2cccc(c2)C(N)=N)c2ccccc2)CC1
: