Target
Bifunctional dihydrofolate reductase-thymidylate synthase
Ligand
BDBM50110760
Substrate
Meas. Tech.
ChEMBL_55402 (CHEMBL668411)
Ki
0.6±n/a nM
Citation
 Tarnchompoo, BSirichaiwat, CPhupong, WIntaraudom, CSirawaraporn, WKamchonwongpaisan, SVanichtanankul, JThebtaranonth, YYuthavong, Y Development of 2,4-diaminopyrimidines as antimalarials based on inhibition of the S108N and C59R+S108N mutants of dihydrofolate reductase from pyrimethamine-resistant Plasmodium falciparum. J Med Chem 45:1244-52 (2002)  
Target
Name:
Bifunctional dihydrofolate reductase-thymidylate synthase
Synonyms:
DHFR-TS Dihydrofolate Reductase-Thymidylate Synthase (DHFR-TS) Mutant KICB1 PfDHFR-TS double mutant (C59R+S108N)
Type:
Enzyme
Mol. Mass.:
71822.51
Organism:
Plasmodium falciparum (isolate K1 / Thailand)
Description:
The mutant clone was prepared by cassette mutagenesis using wildtype pfDHFR as a template, and expressed in E. coli.
Residue:
608
  
Inhibitor
Name:
BDBM50110760
Synonyms:
5-(3-methoxy-4-(3,4,5-trimethoxybenzyloxy)benzyl)pyrimidine-2,4-diamine CHEMBL22811
Type:
Small organic molecule
Emp. Form.:
C22H26N4O5
Mol. Mass.:
426.4656
SMILES:
COc1cc(Cc2cnc(N)nc2N)ccc1OCc1cc(OC)c(OC)c(OC)c1
: