Target
Sodium-dependent dopamine transporter
Ligand
BDBM22165
Substrate
Meas. Tech.
ChEMBL_62478 (CHEMBL677370)
Ki
3.7±n/a nM
Citation
 Hsin, LWDersch, CMBaumann, MHStafford, DGlowa, JRRothman, RBJacobson, AERice, KC Development of long-acting dopamine transporter ligands as potential cocaine-abuse therapeutic agents: chiral hydroxyl-containing derivatives of 1-[2-[bis(4-fluorophenyl)methoxy]ethyl]-4-(3-phenylpropyl)piperazine and 1-[2-(diphenylmethoxy)ethyl]-4-(3-phenylpropyl)piperazine. J Med Chem 45:1321-9 (2002)  
Target
Name:
Sodium-dependent dopamine transporter
Synonyms:
DA transporter SC6A3_RAT Sodium-dependent dopamine transporter | Sodium-dependent dopamine transporter (DAT)
Type:
Multi-pass membrane protein
Mol. Mass.:
68749.45
Organism:
Rattus norvegicus (rat)
Description:
P23977
Residue:
619
  
Inhibitor
Name:
BDBM22165
Synonyms:
1-{2-[bis(4-fluorophenyl)methoxy]ethyl}-4-(3-phenylpropyl)piperazine CHEMBL281594 CHEMBL543876 GBR-12909 US9944618, Compound ID No. 175 | Vanoxerine
Type:
Small organic molecule
Emp. Form.:
C28H32F2N2O
Mol. Mass.:
450.5633
SMILES:
Fc1ccc(cc1)C(OCCN1CCN(CCCc2ccccc2)CC1)c1ccc(F)cc1
: