Target
5-hydroxytryptamine receptor 2A
Ligand
BDBM50551396
Substrate
Meas. Tech.
ChEMBL_2031242 (CHEMBL4685400)
Ki
0.588844±n/a nM
Citation
 Bucki, AMarcinkowska, M?niecikowska, JZagórska, AJamrozik, MPaw?owski, MG?uch-Lutwin, MSiwek, AJakubczyk, MPytka, KJastrz?bska-Wi?sek, MPartyka, AWeso?owska, AMierzejewski, PKo?aczkowski, M Multifunctional 6-fluoro-3-[3-(pyrrolidin-1-yl)propyl]-1,2-benzoxazoles targeting behavioral and psychological symptoms of dementia (BPSD). Eur J Med Chem 191:0 (2020)  
Target
Name:
5-hydroxytryptamine receptor 2A
Synonyms:
5-HT-2 5-HT2A 5-hydroxytryptamine receptor 2A (5HT-2A) 5HT2A_HUMAN HTR2A | Serotonin receptor 2A
Type:
undefined
Mol. Mass.:
52607.65
Organism:
Homo sapiens (Human)
Description:
P28223
Residue:
471
  
Inhibitor
Name:
BDBM50551396
Synonyms:
CHEMBL4748379
Type:
Small organic molecule
Emp. Form.:
C23H25N3O3S2
Mol. Mass.:
455.593
SMILES:
Cc1ccc2sc(cc2c1)S(=O)(=O)N[C@@H]1CCN(CCCc2noc3ccccc23)C1
: