Target
D(2) dopamine receptor
Ligand
BDBM50551392
Substrate
Meas. Tech.
ChEMBL_2031245 (CHEMBL4685403)
Ki
0.630957±n/a nM
Citation
 Bucki, AMarcinkowska, M?niecikowska, JZagórska, AJamrozik, MPaw?owski, MG?uch-Lutwin, MSiwek, AJakubczyk, MPytka, KJastrz?bska-Wi?sek, MPartyka, AWeso?owska, AMierzejewski, PKo?aczkowski, M Multifunctional 6-fluoro-3-[3-(pyrrolidin-1-yl)propyl]-1,2-benzoxazoles targeting behavioral and psychological symptoms of dementia (BPSD). Eur J Med Chem 191:0 (2020)  
Target
Name:
D(2) dopamine receptor
Synonyms:
D(2) dopamine receptor DOPAMINE D2 Long DRD2 Dopamine D2 receptor Dopamine D2 receptor (D2R) Dopamine2-like | d2
Type:
Cell-surface receptors
Mol. Mass.:
50647.10
Organism:
Homo sapiens (Human)
Description:
P14416
Residue:
443
  
Inhibitor
Name:
BDBM50551392
Synonyms:
CHEMBL4747978
Type:
Small organic molecule
Emp. Form.:
C23H24FN3O3S2
Mol. Mass.:
473.583
SMILES:
Cc1c(sc2ccc(F)cc12)S(=O)(=O)N[C@@H]1CCN(CCCc2noc3ccccc23)C1
: