Target
Cannabinoid receptor 1
Ligand
BDBM50074325
Substrate
Meas. Tech.
ChEMBL_46812 (CHEMBL659698)
Ki
165±n/a nM
Citation
 Shim, JYWelsh, WJCartier, EEdwards, JLHowlett, AC Molecular interaction of the antagonist N-(piperidin-1-yl)-5-(4-chlorophenyl)-1- (2,4-dichlorophenyl)-4-methyl-1H-pyrazole-3-carboxamide with the CB1 cannabinoid receptor. J Med Chem 45:1447-59 (2002)  
Target
Name:
Cannabinoid receptor 1
Synonyms:
Brain-type cannabinoid receptor CB-R CNR1_RAT Cannabinoid receptor Cnr1 | Skr6
Type:
G Protein-Coupled Receptor (GPCR)
Mol. Mass.:
52856.55
Organism:
Rattus norvegicus (rat)
Description:
P20272
Residue:
473
  
Inhibitor
Name:
BDBM50074325
Synonyms:
5-(4-Bromo-phenyl)-1-(2,4-dichloro-phenyl)-4-methyl-1H-pyrazole-3-carboxylic acid (2-hydroxy-ethyl)-amide | CHEMBL285486
Type:
Small organic molecule
Emp. Form.:
C19H16BrCl2N3O2
Mol. Mass.:
469.159
SMILES:
Cc1c(nn(c1-c1ccc(Br)cc1)-c1ccc(Cl)cc1Cl)C(=O)NCCO
: