Target
Apoptosis regulator Bcl-2
Ligand
BDBM50196032
Substrate
Meas. Tech.
ChEMBL_2031757 (CHEMBL4685915)
Ki
290±n/a nM
Citation
 Yang, LLWang, HLYan, YHLiu, SYu, ZJHuang, MYLuo, YZheng, XYu, YLi, GB Sensitive fluorogenic substrates for sirtuin deacylase inhibitor discovery. Eur J Med Chem 192:0 (2020)  
Target
Name:
Apoptosis regulator Bcl-2
Synonyms:
Apoptosis regulator Bcl-2 Protein BCL-2 BCL2_HUMAN | Bcl-2 Protein
Type:
Homodimer or heterodimer
Mol. Mass.:
26269.11
Organism:
Homo sapiens (Human)
Description:
P10415
Residue:
239
  
Inhibitor
Name:
BDBM50196032
Synonyms:
(N-[(2-tert-butylbenzenesulfonyl)phenyl]-2,3,4-trihydroxy-5-(2-isopropylbenzyl)benzamide N-[(2-tert-butyl-benzenesulfonyl)-phenyl]-2,3,4-trihydroxy-5-(2-isopropyl-benzyl)-benzamide | TW-37
Type:
Small organic molecule
Emp. Form.:
C33H35NO6S
Mol. Mass.:
573.699
SMILES:
CC(C)c1ccccc1Cc1cc(C(=O)Nc2ccc(cc2)S(=O)(=O)c2ccccc2C(C)(C)C)c(O)c(O)c1O
: