Target
Coagulation factor X
Ligand
BDBM50107066
Substrate
Meas. Tech.
ChEBML_209063
Ki
180±n/a nM
Citation
 St-Denis, YLévesque, SBachand, BEdmunds, JJLeblond, LPréville, PTarazi, MWinocour, PDSiddiqui, MA Novel bicyclic lactam inhibitors of thrombin: highly potent and selective inhibitors. Bioorg Med Chem Lett 12:1181-4 (2002)  
Target
Name:
Coagulation factor X
Synonyms:
Activated coagulation factor X (FXa) Coagulation factor X precursor F10 Factor X heavy chain Factor Xa Stuart-Prower factor
Type:
Enzyme
Mol. Mass.:
54726.60
Organism:
Homo sapiens (Human)
Description:
Residue:
488
  
Inhibitor
Name:
BDBM50107066
Synonyms:
(6S,8aS)-4-Oxo-2-(3-phenyl-propionyl)-octahydro-pyrrolo[1,2-a]pyrazine-6-carboxylic acid (1-carbamimidoyl-piperidin-4-ylmethyl)-amide | CHEMBL17715
Type:
Small organic molecule
Emp. Form.:
C24H34N6O3
Mol. Mass.:
454.5652
SMILES:
NC(=N)N1CCC(CNC(=O)[C@@H]2CC[C@H]3CN(CC(=O)N23)C(=O)CCc2ccccc2)CC1
: