Target
Cannabinoid receptor 1
Ligand
BDBM50174315
Substrate
Meas. Tech.
ChEMBL_2033483 (CHEMBL4687641)
Ki
842±n/a nM
Citation
 Nelson, KMBisson, JSingh, GGraham, JGChen, SNFriesen, JBDahlin, JLNiemitz, MWalters, MAPauli, GF The Essential Medicinal Chemistry of Cannabidiol (CBD). J Med Chem 63:12137-12155 (2020)  
Target
Name:
Cannabinoid receptor 1
Synonyms:
Brain-type cannabinoid receptor CB-R CNR1_RAT Cannabinoid receptor Cnr1 | Skr6
Type:
G Protein-Coupled Receptor (GPCR)
Mol. Mass.:
52856.55
Organism:
Rattus norvegicus (rat)
Description:
P20272
Residue:
473
  
Inhibitor
Name:
BDBM50174315
Synonyms:
CHEMBL3810140
Type:
Small organic molecule
Emp. Form.:
C21H30O2
Mol. Mass.:
314.4617
SMILES:
CCCCCc1cc(O)c([C@H]2C=C(C)CC[C@@H]2C(C)=C)c(O)c1
: