Target
Atrial natriuretic peptide receptor 1
Ligand
BDBM50112321
Substrate
Meas. Tech.
ChEBML_144255
EC50
0.680000±n/a nM
Citation
 Sugase, KOyama, YKitano, KAkutsu, HIshiguro, M Structure-activity relationships for mini atrial natriuretic peptide by proline-scanning mutagenesis and shortening of peptide backbone. Bioorg Med Chem Lett 12:1245-7 (2002)  
Target
Name:
Atrial natriuretic peptide receptor 1
Synonyms:
ANP-A ANPRA_HUMAN Atrial natriuretic peptide receptor GC-A NPR-A | NPR1
Type:
PROTEIN
Mol. Mass.:
118919.35
Organism:
Homo sapiens (Human)
Description:
ChEMBL_700223
Residue:
1061
  
Inhibitor
Name:
BDBM50112321
Synonyms:
Atrial natriuretic peptide analogue mintANP
Type:
Small organic molecule
Emp. Form.:
C75H117N27O19S4
Mol. Mass.:
1829.161
SMILES:
CC[C@H](C)[C@@H]1NC(=O)[C@@H](CCCNC(N)=N)NC(=O)[C@H](CC(O)=O)NC(=O)[C@@H](CCSC)NC(=O)[C@H](CCCNC(N)=N)NC(=O)CNC(=O)CNC(=O)[C@@H](Cc2ccccc2)NC(=O)[C@H](Cc2cnc[nH]2)NC(=O)[C@H](CSSC[C@@H](NC(=O)[C@@H](CO)NC1=O)C(=O)N[C@@H](Cc1ccc(O)cc1)C(=O)N[C@@H](CCCNC(N)=N)C(N)=O)NC(=O)[C@@H](N)CCSC
: