Target
Sodium-dependent dopamine transporter
Ligand
BDBM86701
Substrate
Meas. Tech.
ChEBML_216123
Ki
11±n/a nM
Citation
 Zou, MFAgoston, GEBelov, YKopajtic, TKatz, JLNewman, AH Enantioselective synthesis of S-(+)-2beta-carboalkoxy-3alpha-[bis(4-fluorophenyl)methoxy]tropanes as novel probes for the dopamine transporter. Bioorg Med Chem Lett 12:1249-52 (2002)  
Target
Name:
Sodium-dependent dopamine transporter
Synonyms:
DA transporter SC6A3_RAT Sodium-dependent dopamine transporter | Sodium-dependent dopamine transporter (DAT)
Type:
Multi-pass membrane protein
Mol. Mass.:
68749.45
Organism:
Rattus norvegicus (rat)
Description:
P23977
Residue:
619
  
Inhibitor
Name:
BDBM86701
Synonyms:
3-(bis(4-fluorophenyl)methoxy)-8-methyl-8-aza-bicyclo[3.2.1]octane 3-[Bis-(4-fluoro-phenyl)-methoxy]-8-methyl-8-azonia-bicyclo[3.2.1]octane CHEMBL317757 | CHEMBL543113
Type:
Small organic molecule
Emp. Form.:
C21H23F2NO
Mol. Mass.:
343.4102
SMILES:
CN1C2CCC1CC(C2)OC(c1ccc(F)cc1)c1ccc(F)cc1
: