Target
Estrogen receptor
Ligand
BDBM50112407
Substrate
Meas. Tech.
ChEMBL_67667 (CHEMBL673860)
Kd
5.8±n/a nM
Citation
 Adamczyk, MReddy, REYu, Z Synthesis of a novel fluorescent probe for estrogen receptor. Bioorg Med Chem Lett 12:1283-5 (2002)  
Target
Name:
Estrogen receptor
Synonyms:
ER ESR ESR1_HUMAN Estrogen receptor Estrogen receptor (ER-alpha) Estrogen receptor alpha (ER) Nuclear receptor subfamily 3 group A member 1
Type:
Protein
Mol. Mass.:
66230.44
Organism:
Homo sapiens (Human)
Description:
P03372
Residue:
595
  
Inhibitor
Name:
BDBM50112407
Synonyms:
5-(3-{4-[1-ethyl-2-(4-hydroxyphenyl)-(E)-1-butenyl]phenoxy}propylcarboxamidomethyl)-2-(6-hydroxy-3-oxo-3H-9-xanthenyl)benzoic acid | CHEMBL22486
Type:
Small organic molecule
Emp. Form.:
C43H39NO8
Mol. Mass.:
697.7717
SMILES:
CC\C(=C(\CC)c1ccc(OCCCC(=O)NCc2ccc(c(c2)C(O)=O)-c2c3ccc(O)cc3oc3cc(=O)ccc23)cc1)c1ccc(O)cc1
: