Target
Indoleamine 2,3-dioxygenase 1
Ligand
BDBM50552936
Substrate
Meas. Tech.
ChEMBL_2035521 (CHEMBL4689679)
IC50
22±n/a nM
Target
Name:
Indoleamine 2,3-dioxygenase 1
Synonyms:
I23O1_HUMAN IDO-1 INDO Indoleamine 2,3-dioxygenase | Indoleamine-pyrrole 2,3-dioxygenase
Type:
Enzyme
Mol. Mass.:
45330.80
Organism:
Homo sapiens (Human)
Description:
P14902
Residue:
403
  
Inhibitor
Name:
BDBM50552936
Synonyms:
CHEMBL4747995
Type:
Small organic molecule
Emp. Form.:
C19H20FN3O3
Mol. Mass.:
357.3788
SMILES:
COC(=O)N1CCCc2nc(ccc12)[C@@H](C)NC(=O)c1ccc(F)cc1
: