Target
Cytochrome P450 2C9
Ligand
BDBM50552940
Substrate
Meas. Tech.
ChEMBL_2035530 (CHEMBL4689688)
IC50
6200±n/a nM
Target
Name:
Cytochrome P450 2C9
Synonyms:
(R)-limonene 6-monooxygenase CP2C9_HUMAN CYP2C9 Cytochrome P450 2C9 (CYP2C9 ) P-450MP P450 PB-1 | S-mephenytoin 4-hydroxylase
Type:
Enzyme
Mol. Mass.:
55636.33
Organism:
Homo sapiens (Human)
Description:
P11712
Residue:
490
  
Inhibitor
Name:
BDBM50552940
Synonyms:
CHEMBL4749009
Type:
Small organic molecule
Emp. Form.:
C21H22FN3O3
Mol. Mass.:
383.4161
SMILES:
C[C@@H](NC(=O)c1ccc(F)cc1)c1ccc2N(CCCc2n1)C(=O)OC1CC1
: