Target
Disintegrin and metalloproteinase domain-containing protein 17
Ligand
BDBM50113026
Substrate
Meas. Tech.
ChEMBL_212741 (CHEMBL816559)
IC50
49±n/a nM
Citation
 Letavic, MAAxt, MZBarberia, JTCarty, TJDanley, DEGeoghegan, KFHalim, NSHoth, LRKamath, AVLaird, ERLopresti-Morrow, LLMcClure, KFMitchell, PGNatarajan, VNoe, MCPandit, JReeves, LSchulte, GKSnow, SLSweeney, FJTan, DHYu, CH Synthesis and biological activity of selective pipecolic acid-based TNF-alpha converting enzyme (TACE) inhibitors. Bioorg Med Chem Lett 12:1387-90 (2002)  
Target
Name:
Disintegrin and metalloproteinase domain-containing protein 17
Synonyms:
ADA17_HUMAN CSVP Disintegrin and metalloproteinase domain-containing protein 17 (ADAM17) TNF-alpha convertase TNF-alpha-converting enzyme (TACE) Tumor necrosis factor-α converting enzyme (TACE)
Type:
Enzyme
Mol. Mass.:
93007.89
Organism:
Homo sapiens (Human)
Description:
Residue:
824
  
Inhibitor
Name:
BDBM50113026
Synonyms:
(2R,5R)-1-[4-(3-Cyano-benzyloxy)-benzenesulfonyl]-5-hydroxy-piperidine-2-carboxylic acid hydroxyamide | CHEMBL28678
Type:
Small organic molecule
Emp. Form.:
C20H21N3O6S
Mol. Mass.:
431.462
SMILES:
ONC(=O)[C@H]1CC[C@@H](O)CN1S(=O)(=O)c1ccc(OCc2cccc(c2)C#N)cc1
: