Target
Disintegrin and metalloproteinase domain-containing protein 17
Ligand
BDBM50113030
Substrate
Meas. Tech.
ChEMBL_212741 (CHEMBL816559)
IC50
20±n/a nM
Citation
 Letavic, MAAxt, MZBarberia, JTCarty, TJDanley, DEGeoghegan, KFHalim, NSHoth, LRKamath, AVLaird, ERLopresti-Morrow, LLMcClure, KFMitchell, PGNatarajan, VNoe, MCPandit, JReeves, LSchulte, GKSnow, SLSweeney, FJTan, DHYu, CH Synthesis and biological activity of selective pipecolic acid-based TNF-alpha converting enzyme (TACE) inhibitors. Bioorg Med Chem Lett 12:1387-90 (2002)  
Target
Name:
Disintegrin and metalloproteinase domain-containing protein 17
Synonyms:
ADA17_HUMAN CSVP Disintegrin and metalloproteinase domain-containing protein 17 (ADAM17) TNF-alpha convertase TNF-alpha-converting enzyme (TACE) Tumor necrosis factor-α converting enzyme (TACE)
Type:
Enzyme
Mol. Mass.:
93007.89
Organism:
Homo sapiens (Human)
Description:
Residue:
824
  
Inhibitor
Name:
BDBM50113030
Synonyms:
(2R,4S)-4-Hydroxy-1-[4-(4-methyl-benzyloxy)-benzenesulfonyl]-piperidine-2-carboxylic acid hydroxyamide | CHEMBL28815
Type:
Small organic molecule
Emp. Form.:
C20H24N2O6S
Mol. Mass.:
420.479
SMILES:
Cc1ccc(COc2ccc(cc2)S(=O)(=O)N2CC[C@H](O)C[C@@H]2C(=O)NO)cc1
: