Target
Interstitial collagenase
Ligand
BDBM50113040
Substrate
Meas. Tech.
ChEBML_105983
IC50
1600±n/a nM
Citation
 Letavic, MAAxt, MZBarberia, JTCarty, TJDanley, DEGeoghegan, KFHalim, NSHoth, LRKamath, AVLaird, ERLopresti-Morrow, LLMcClure, KFMitchell, PGNatarajan, VNoe, MCPandit, JReeves, LSchulte, GKSnow, SLSweeney, FJTan, DHYu, CH Synthesis and biological activity of selective pipecolic acid-based TNF-alpha converting enzyme (TACE) inhibitors. Bioorg Med Chem Lett 12:1387-90 (2002)  
Target
Name:
Interstitial collagenase
Synonyms:
CLG MMP1 Matrix metalloproteinase-1 | Matrix metalloproteinase-1 (MMP-1)
Type:
Enzyme
Mol. Mass.:
54010.26
Organism:
Homo sapiens (Human)
Description:
P03956
Residue:
469
  
Inhibitor
Name:
BDBM50113040
Synonyms:
(2R,4R)-1-[4-(4-Fluoro-benzyloxy)-benzenesulfonyl]-2-hydroxycarbamoyl-piperidine-4-carboxylic acid methyl ester | CHEMBL283026
Type:
Small organic molecule
Emp. Form.:
C21H23FN2O7S
Mol. Mass.:
466.48
SMILES:
COC(=O)[C@@H]1CCN([C@H](C1)C(=O)NO)S(=O)(=O)c1ccc(OCc2ccc(F)cc2)cc1
: